Tests in error:
testInsert(com.apress.prospring3.springblog.service.jpa.EntryServiceImplTest)
Tests run: 2, Failures: 0, Errors: 1, Skipped: 0
[INFO] ------------------------------------------------------------------------
[INFO] BUILD FAILURE
[INFO] ------------------------------------------------------------------------
[INFO] Total time: 25.219s
[INFO] Finished at: Sat Sep 27 10:20:54 IST 2014
[INFO] Final Memory: 6M/13M
[INFO] ------------------------------------------------------------------------
[ERROR] Failed to execute goal org.apache.maven.plugins:maven-surefire-plugin:2.
12:test (default-test) on project springblog: There are test failures.
[ERROR]
[ERROR] Please refer to targets\surefire-reports for the individual test results.
[ERROR] -> [Help 1]
org.apache.maven.lifecycle.LifecycleExecutionException: Failed to execute goal o
rg.apache.maven.plugins:maven-surefire-plugin:2.12:test (default-test) on projec
t springblog: There are test failures.
at org.apache.maven.lifecycle.internal.MojoExecutor.execute(MojoExecutor
.java:212)
at org.apache.maven.lifecycle.internal.MojoExecutor.execute(MojoExecutor
.java:153)
at org.apache.maven.lifecycle.internal.MojoExecutor.execute(MojoExecutor
.java:145)
at org.apache.maven.lifecycle.internal.LifecycleModuleBuilder.buildProje
ct(LifecycleModuleBuilder.java:84)
at org.apache.maven.lifecycle.internal.LifecycleModuleBuilder.buildProje
ct(LifecycleModuleBuilder.java:59)
at org.apache.maven.lifecycle.internal.LifecycleStarter.singleThreadedBu
ild(LifecycleStarter.java:183)
at org.apache.maven.lifecycle.internal.LifecycleStarter.execute(Lifecycl
eStarter.java:161)
at org.apache.maven.DefaultMaven.doExecute(DefaultMaven.java:317)
at org.apache.maven.DefaultMaven.execute(DefaultMaven.java:152)
at org.apache.maven.cli.MavenCli.execute(MavenCli.java:555)
at org.apache.maven.cli.MavenCli.doMain(MavenCli.java:214)
at org.apache.maven.cli.MavenCli.main(MavenCli.java:158)
at sun.reflect.NativeMethodAccessorImpl.invoke0(Native Method)
at sun.reflect.NativeMethodAccessorImpl.invoke(NativeMethodAccessorImpl.
java:39)
at sun.reflect.DelegatingMethodAccessorImpl.invoke(DelegatingMethodAcces
sorImpl.java:25)
at java.lang.reflect.Method.invoke(Method.java:597)
at org.codehaus.plexus.classworlds.launcher.Launcher.launchEnhanced(Laun
cher.java:289)
at org.codehaus.plexus.classworlds.launcher.Launcher.launch(Launcher.jav
a:229)
at org.codehaus.plexus.classworlds.launcher.Launcher.mainWithExitCode(La
uncher.java:415)
at org.codehaus.plexus.classworlds.launcher.Launcher.main(Launcher.java:
356)
Caused by: org.apache.maven.plugin.MojoFailureException: There are test failures
.
Please refer to D:\A-Workspace\Spring-et-all\springblog-master\springblog-master
\target\surefire-reports for the individual test results.
at org.apache.maven.plugin.surefire.SurefireHelper.reportExecution(Suref
ireHelper.java:83)
at org.apache.maven.plugin.surefire.SurefirePlugin.writeSummary(Surefire
Plugin.java:673)
at org.apache.maven.plugin.surefire.SurefirePlugin.handleSummary(Surefir
ePlugin.java:647)
at org.apache.maven.plugin.surefire.AbstractSurefireMojo.executeAfterPre
conditionsChecked(AbstractSurefireMojo.java:137)
at org.apache.maven.plugin.surefire.AbstractSurefireMojo.execute(Abstrac
tSurefireMojo.java:98)
at org.apache.maven.plugin.DefaultBuildPluginManager.executeMojo(Default
BuildPluginManager.java:106)
at org.apache.maven.lifecycle.internal.MojoExecutor.execute(MojoExecutor
.java:208)
... 19 more
[ERROR]
[ERROR] Re-run Maven using the -X switch to enable full debug logging.
[ERROR]
[ERROR] For more information about the errors and possible solutions, please rea
d the following articles:
[ERROR] [Help 1] http://cwiki.apache.org/confluence/display/MAVEN/MojoFailureExc
eption
testInsert(com.apress.prospring3.springblog.service.jpa.EntryServiceImplTest)
Tests run: 2, Failures: 0, Errors: 1, Skipped: 0
[INFO] ------------------------------------------------------------------------
[INFO] BUILD FAILURE
[INFO] ------------------------------------------------------------------------
[INFO] Total time: 25.219s
[INFO] Finished at: Sat Sep 27 10:20:54 IST 2014
[INFO] Final Memory: 6M/13M
[INFO] ------------------------------------------------------------------------
[ERROR] Failed to execute goal org.apache.maven.plugins:maven-surefire-plugin:2.
12:test (default-test) on project springblog: There are test failures.
[ERROR]
[ERROR] Please refer to targets\surefire-reports for the individual test results.
[ERROR] -> [Help 1]
org.apache.maven.lifecycle.LifecycleExecutionException: Failed to execute goal o
rg.apache.maven.plugins:maven-surefire-plugin:2.12:test (default-test) on projec
t springblog: There are test failures.
at org.apache.maven.lifecycle.internal.MojoExecutor.execute(MojoExecutor
.java:212)
at org.apache.maven.lifecycle.internal.MojoExecutor.execute(MojoExecutor
.java:153)
at org.apache.maven.lifecycle.internal.MojoExecutor.execute(MojoExecutor
.java:145)
at org.apache.maven.lifecycle.internal.LifecycleModuleBuilder.buildProje
ct(LifecycleModuleBuilder.java:84)
at org.apache.maven.lifecycle.internal.LifecycleModuleBuilder.buildProje
ct(LifecycleModuleBuilder.java:59)
at org.apache.maven.lifecycle.internal.LifecycleStarter.singleThreadedBu
ild(LifecycleStarter.java:183)
at org.apache.maven.lifecycle.internal.LifecycleStarter.execute(Lifecycl
eStarter.java:161)
at org.apache.maven.DefaultMaven.doExecute(DefaultMaven.java:317)
at org.apache.maven.DefaultMaven.execute(DefaultMaven.java:152)
at org.apache.maven.cli.MavenCli.execute(MavenCli.java:555)
at org.apache.maven.cli.MavenCli.doMain(MavenCli.java:214)
at org.apache.maven.cli.MavenCli.main(MavenCli.java:158)
at sun.reflect.NativeMethodAccessorImpl.invoke0(Native Method)
at sun.reflect.NativeMethodAccessorImpl.invoke(NativeMethodAccessorImpl.
java:39)
at sun.reflect.DelegatingMethodAccessorImpl.invoke(DelegatingMethodAcces
sorImpl.java:25)
at java.lang.reflect.Method.invoke(Method.java:597)
at org.codehaus.plexus.classworlds.launcher.Launcher.launchEnhanced(Laun
cher.java:289)
at org.codehaus.plexus.classworlds.launcher.Launcher.launch(Launcher.jav
a:229)
at org.codehaus.plexus.classworlds.launcher.Launcher.mainWithExitCode(La
uncher.java:415)
at org.codehaus.plexus.classworlds.launcher.Launcher.main(Launcher.java:
356)
Caused by: org.apache.maven.plugin.MojoFailureException: There are test failures
.
Please refer to D:\A-Workspace\Spring-et-all\springblog-master\springblog-master
\target\surefire-reports for the individual test results.
at org.apache.maven.plugin.surefire.SurefireHelper.reportExecution(Suref
ireHelper.java:83)
at org.apache.maven.plugin.surefire.SurefirePlugin.writeSummary(Surefire
Plugin.java:673)
at org.apache.maven.plugin.surefire.SurefirePlugin.handleSummary(Surefir
ePlugin.java:647)
at org.apache.maven.plugin.surefire.AbstractSurefireMojo.executeAfterPre
conditionsChecked(AbstractSurefireMojo.java:137)
at org.apache.maven.plugin.surefire.AbstractSurefireMojo.execute(Abstrac
tSurefireMojo.java:98)
at org.apache.maven.plugin.DefaultBuildPluginManager.executeMojo(Default
BuildPluginManager.java:106)
at org.apache.maven.lifecycle.internal.MojoExecutor.execute(MojoExecutor
.java:208)
... 19 more
[ERROR]
[ERROR] Re-run Maven using the -X switch to enable full debug logging.
[ERROR]
[ERROR] For more information about the errors and possible solutions, please rea
d the following articles:
[ERROR] [Help 1] http://cwiki.apache.org/confluence/display/MAVEN/MojoFailureExc
eption
No comments:
Post a Comment